Details

      Description

      The build fails by the following problem

      Tests in error:
        testConnectorFile_shouldBeInstalled(org.openengsb.core.services.internal.deployer.connector.ConnectorDeployerServiceTest): No SecurityManager accessible to th
      e calling code, either bound to the org.apache.shiro.util.ThreadContext or as a vm static singleton.  This is an invalid application configuration.
        testConnectorFileWithRanking_shouldBeInstalledWithNumericRanking(org.openengsb.core.services.internal.deployer.connector.ConnectorDeployerServiceTest): No Sec
      urityManager accessible to the calling code, either bound to the org.apache.shiro.util.ThreadContext or as a vm static singleton.  This is an invalid applicatio
      n configuration.
        testConnectorFileWithArraysAndTrailingSpace_shouldBeInstalled(org.openengsb.core.services.internal.deployer.connector.ConnectorDeployerServiceTest): No Securi
      tyManager accessible to the calling code, either bound to the org.apache.shiro.util.ThreadContext or as a vm static singleton.  This is an invalid application c
      onfiguration.
        testUpdateService_shouldNotOverrideOtherwiseModifedProperties(org.openengsb.core.services.internal.deployer.connector.ConnectorDeployerServiceTest): No Securi
      tyManager accessible to the calling code, either bound to the org.apache.shiro.util.ThreadContext or as a vm static singleton.  This is an invalid application c
      onfiguration.
        testUpdateServiceViaPersistence_shouldNotOverwriteProperties(org.openengsb.core.services.internal.deployer.connector.ConnectorDeployerServiceTest): No Securit
      yManager accessible to the calling code, either bound to the org.apache.shiro.util.ThreadContext or as a vm static singleton.  This is an invalid application co
      nfiguration.
        testConnectorFileWithArrays_shouldBeInstalled(org.openengsb.core.services.internal.deployer.connector.ConnectorDeployerServiceTest): No SecurityManager access
      ible to the calling code, either bound to the org.apache.shiro.util.ThreadContext or as a vm static singleton.  This is an invalid application configuration.
        testUninstallService_shouldRemoveFromRegistry(org.openengsb.core.services.internal.deployer.connector.ConnectorDeployerServiceTest): No SecurityManager access
      ible to the calling code, either bound to the org.apache.shiro.util.ThreadContext or as a vm static singleton.  This is an invalid application configuration.
        testUpdateService_shouldKeepInternalProperties(org.openengsb.core.services.internal.deployer.connector.ConnectorDeployerServiceTest): No SecurityManager acces
      sible to the calling code, either bound to the org.apache.shiro.util.ThreadContext or as a vm static singleton.  This is an invalid application configuration.
        testInstallService_shouldNotOverwriteExistingService(org.openengsb.core.services.internal.deployer.connector.ConnectorDeployerServiceTest): No SecurityManager
       accessible to the calling code, either bound to the org.apache.shiro.util.ThreadContext or as a vm static singleton.  This is an invalid application configurat
      ion.
        testUpdateAttributeViaPersistence_shouldNotOverwrite(org.openengsb.core.services.internal.deployer.connector.ConnectorDeployerServiceTest): No SecurityManager
       accessible to the calling code, either bound to the org.apache.shiro.util.ThreadContext or as a vm static singleton.  This is an invalid application configurat
      ion.
        testRemovePropertyFromConfig_shouldRemoveProperty(org.openengsb.core.services.internal.deployer.connector.ConnectorDeployerServiceTest): No SecurityManager ac
      cessible to the calling code, either bound to the org.apache.shiro.util.ThreadContext or as a vm static singleton.  This is an invalid application configuration
      .
        testModifyAttributeInBothPlaces_shouldThrowException(org.openengsb.core.services.internal.deployer.connector.ConnectorDeployerServiceTest): No SecurityManager
       accessible to the calling code, either bound to the org.apache.shiro.util.ThreadContext or as a vm static singleton.  This is an invalid application configurat
      ion.
        testUpdateAttributeViaFileTwice_shouldUpdateTwice(org.openengsb.core.services.internal.deployer.connector.ConnectorDeployerServiceTest): No SecurityManager ac
      cessible to the calling code, either bound to the org.apache.shiro.util.ThreadContext or as a vm static singleton.  This is an invalid application configuration
      .
        testUpdateFailure_shouldReplaceWithOldConfigFile(org.openengsb.core.services.internal.deployer.connector.ConnectorDeployerServiceTest): No SecurityManager acc
      essible to the calling code, either bound to the org.apache.shiro.util.ThreadContext or as a vm static singleton.  This is an invalid application configuration.
       
        testUpdateConnectorFile_shouldBeUpdated(org.openengsb.core.services.internal.deployer.connector.ConnectorDeployerServiceTest): No SecurityManager accessible t
      o the calling code, either bound to the org.apache.shiro.util.ThreadContext or as a vm static singleton.  This is an invalid application configuration.
        testRootService_shouldHaveLowerRanking(org.openengsb.core.services.internal.deployer.connector.ConnectorDeployerServiceTest): No SecurityManager accessible to
       the calling code, either bound to the org.apache.shiro.util.ThreadContext or as a vm static singleton.  This is an invalid application configuration.
        testNormalService_shouldHaveNoRankingAdded(org.openengsb.core.services.internal.deployer.connector.ConnectorDeployerServiceTest): No SecurityManager accessibl
      e to the calling code, either bound to the org.apache.shiro.util.ThreadContext or as a vm static singleton.  This is an invalid application configuration.
        testOverridenRanking_shouldNotBeAltered(org.openengsb.core.services.internal.deployer.connector.ConnectorDeployerServiceTest): No SecurityManager accessible t
      o the calling code, either bound to the org.apache.shiro.util.ThreadContext or as a vm static singleton.  This is an invalid application configuration.
        testUpdateFailure_shouldCreateBackupFile(org.openengsb.core.services.internal.deployer.connector.ConnectorDeployerServiceTest): No SecurityManager accessible
      to the calling code, either bound to the org.apache.shiro.util.ThreadContext or as a vm static singleton.  This is an invalid application configuration.
        testInstallFailure_shouldLeaveFileAsIs(org.openengsb.core.services.internal.deployer.connector.ConnectorDeployerServiceTest): No SecurityManager accessible to
       the calling code, either bound to the org.apache.shiro.util.ThreadContext or as a vm static singleton.  This is an invalid application configuration.
        testUpdateTwice_shouldUpdateCachedVersion(org.openengsb.core.services.internal.deployer.connector.ConnectorDeployerServiceTest): No SecurityManager accessible
       to the calling code, either bound to the org.apache.shiro.util.ThreadContext or as a vm static singleton.  This is an invalid application configuration.
        testRemovePropertyOnBothEnds_shouldStayRemovedWithoutError(org.openengsb.core.services.internal.deployer.connector.ConnectorDeployerServiceTest): No SecurityM
      anager accessible to the calling code, either bound to the org.apache.shiro.util.ThreadContext or as a vm static singleton.  This is an invalid application conf
      iguration.
       
      Tests run: 137, Failures: 0, Errors: 22, Skipped: 0
       
      [INFO] ------------------------------------------------------------------------
      [INFO] Reactor Summary:
      [INFO]
      [INFO] OpenEngSB :: Framework :: Parent .................. SUCCESS [1.242s]
      [INFO] OpenEngSB :: Tooling :: Archetypes :: Parent ...... SUCCESS [0.060s]
      [INFO] OpenEngSB :: Tooling :: Archetypes :: Connector ... SUCCESS [2.063s]
      [INFO] OpenEngSB :: Tooling :: Archetypes :: Domain ...... SUCCESS [0.300s]
      [INFO] OpenEngSB :: Loom :: CSharp :: Common :: WSDL to DLL Maven Plugin  SUCCESS [5.027s]
      [INFO] OpenEngSB :: Framework :: Util .................... SUCCESS [35.652s]
      [INFO] OpenEngSB :: Framework :: Common .................. SUCCESS [7.811s]
      [INFO] OpenEngSB :: Framework :: Weaver Service .......... SUCCESS [8.162s]
      [INFO] OpenEngSB :: Framework :: Weaver Test ............. SUCCESS [3.705s]
      [INFO] OpenEngSB :: Domain :: Authentication ............. SUCCESS [1.512s]
      [INFO] OpenEngSB :: Domain :: Authorization .............. SUCCESS [1.673s]
      [INFO] OpenEngSB :: Connector :: UsernamePassword ........ SUCCESS [2.483s]
      [INFO] OpenEngSB :: Connector :: Service ACL ............. SUCCESS [2.434s]
      [INFO] OpenEngSB :: Framework :: Persistence Layer ....... SUCCESS [5.538s]
      [INFO] OpenEngSB :: Framework :: Services ................ FAILURE [50.659s]
      [INFO] OpenEngSB :: Framework :: Console ................. SKIPPED
      [INFO] OpenEngSB :: Framework :: EDB :: JPA .............. SKIPPED
      [INFO] OpenEngSB :: Framework :: EKB :: Common ........... SKIPPED
      [INFO] OpenEngSB :: Framework :: EKB :: GraphDB :: Orient  SKIPPED
      [INFO] OpenEngSB :: Framework :: EKB :: Model Registry :: Tracker  SKIPPED
      [INFO] OpenEngSB :: Framework :: EKB :: Persistence :: Query :: EDB  SKIPPED
      [INFO] OpenEngSB :: Framework :: EKB :: Transformation :: Wonderland  SKIPPED
      [INFO] OpenEngSB :: Framework :: EKB :: Persistence :: Persist :: EDB  SKIPPED
      [INFO] OpenEngSB :: Domain :: Example .................... SKIPPED
      [INFO] OpenEngSB :: Domain :: Auditing ................... SKIPPED
      [INFO] OpenEngSB :: Framework :: Workflow :: Drools ...... SKIPPED
      [INFO] OpenEngSB :: Framework :: Info .................... SKIPPED
      [INFO] OpenEngSB :: Connector :: Virtual :: Filewatcher .. SKIPPED
      [INFO] OpenEngSB :: Connector :: MemoryAuditing .......... SKIPPED
      [INFO] OpenEngSB :: Connector :: Example ................. SKIPPED
      [INFO] OpenEngSB :: Persistence :: Context ............... SKIPPED
      [INFO] OpenEngSB :: Persistence :: Connector ............. SKIPPED
      [INFO] OpenEngSB :: Persistence :: Rulebase .............. SKIPPED
      [INFO] OpenEngSB :: Infrastructure :: JPA ................ SKIPPED
      [INFO] OpenEngSB :: Infrastructure :: JMS ................ SKIPPED
      [INFO] OpenEngSB :: Ports :: JMS ......................... SKIPPED
      [INFO] OpenEngSB :: Ports :: Webservices ................. SKIPPED
      [INFO] OpenEngSB :: User Interface :: Common ............. SKIPPED
      [INFO] OpenEngSB :: Connector :: Wicket ACL .............. SKIPPED
      [INFO] OpenEngSB :: Domain :: OOSourceCode ............... SKIPPED
      [INFO] OpenEngSB :: Domain :: SQLCode .................... SKIPPED
      [INFO] OpenEngSB :: User Interface :: Administration ..... SKIPPED
      [INFO] OpenEngSB :: Framework :: Assembly ................ SKIPPED
      [INFO] OpenEngSB :: Examples :: Java Remote Client ....... SKIPPED
      [INFO] OpenEngSB :: Examples :: Remote Samples ........... SKIPPED
      [INFO] OpenEngSB :: Framework :: Integration Tests ....... SKIPPED
      [INFO] ------------------------------------------------------------------------
      [INFO] BUILD FAILURE
      [INFO] ------------------------------------------------------------------------
      [INFO] Total time: 2:14.858s
      [INFO] Finished at: Wed Jan 23 04:11:58 PST 2013
      [INFO] Final Memory: 32M/80M
      [INFO] ------------------------------------------------------------------------
      [ERROR] Failed to execute goal org.apache.maven.plugins:maven-surefire-plugin:2.12:test (default-test) on project org.openengsb.framework.services: There are te
      st failures.
      [ERROR]
      [ERROR] Please refer to C:\Users\pieber\Documents\GitHub\openengsb-framework\components\services\target\surefire-reports for the individual test results.
      [ERROR] -> [Help 1]
      [ERROR]
      [ERROR] To see the full stack trace of the errors, re-run Maven with the -e switch.
      [ERROR] Re-run Maven using the -X switch to enable full debug logging.
      [ERROR]
      [ERROR] For more information about the errors and possible solutions, please read the following articles:
      [ERROR] [Help 1] http://cwiki.apache.org/confluence/display/MAVEN/MojoFailureException
      [ERROR]
      [ERROR] After correcting the problems, you can resume the build with the command
      [ERROR]   mvn <goals> -rf :org.openengsb.framework.services
      C:\Users\pieber\Documents\GitHub\openengsb-framework [master]> i

        Gliffy Diagrams

          Issue Links

          No reviews matched the request. Check your Options in the drop-down menu of this sections header.

            Activity

            There are no comments yet on this issue.

              People

              • Assignee:
                Andreas Pieber
                Reporter:
                Andreas Pieber
              • Votes:
                0 Vote for this issue
                Watchers:
                1 Start watching this issue

                Dates

                • Created:
                  Updated:
                  Resolved: